Error With Cmake Win32 Build

collect2: ld returned 1 exit status
mingw32-make[2]: *** [bin/blender.exe] Error 1
mingw32-make[1]: *** [source/creator/CMakeFiles/blender.dir/all] Error 2
mingw32-make: *** [all] Error 2

I don’t get a blender.exe file in the bin folder. I’m just not sure how to fix this. I’m following the instructions on blender wiki. Everything was running fine till the very end… thus here xD… which seems to be the last step in which I get the error from up top (in bold).

There must be an error line before the lines you posted. This output does not help.

Make sure you have updated your lib folder. There were some changes.

Nvm… finally figured it out.